{"text_format":"1","workbook":"xlsx","n_sheets":14,"sheets":["RCN","TofC","TR55","Runoff Volumes"," Infiltration Basin"," Simplified Infil Basin ","Detention Basins","Swales","Bioretention","Sand Filter","SBUH","Lookup","Soils","Help"],"not_rendered":{"charts":2,"images":8,"macros":1,"external_links":1,"defined_names":130,"comments":0,"pivot_tables":0},"unopened":[],"bounds":{"document_bytes":16777216,"sheet_cells":100000,"rows_first":2000,"rows_last":500,"rows_between":2000,"halvings":0,"cell_chars":16384,"cell_head_chars":4096},"cells_cut":0,"cells_raw":0,"read":"whole","date_system":"1900"}

{"sheet":"RCN","index":0,"n_rows":91,"n_cols":31,"rows_kept":91,"cut":false,"hidden":false,"merged":[[88,7,88,9],[90,2,90,9],[88,21,88,23],[90,16,90,23],[7,18,7,29],[8,18,8,20],[8,21,8,23],[8,24,8,26],[8,27,8,29],[7,4,7,15],[8,4,8,6],[8,7,8,9],[8,10,8,12],[8,13,8,15],[0,0,0,15],[3,7,3,8],[4,7,4,8],[3,9,3,15],[4,9,4,12]]}
["Runnoff Curve Number"]
[]
["Project:"]
["Designer:",null,null,null,null,null,null,"Checked:"]
["Date:",null,null,null,null,null,null,"Date:"]
[]
[]
["Cover Type","Treatment","Hydrologic Condition",null,"Runoff Curve Number - Pre Development",null,null,null,null,null,null,null,null,null,null,null,null,null,"Runoff Curve Number - Post Development"]
[null,null,null,null,"A",null,null,"B",null,null,"C",null,null,"D",null,null,null,null,"A",null,null,"B",null,null,"C",null,null,"D"]
[null,null,null,null,"Area","CN","Area x CN","Area","CN","Area x CN","Area","CN","Area x CN","Area ","CN","Area x CN",null,null,"Area","CN","Area x CN","Area","CN","Area x CN","Area","CN","Area x CN","Area ","CN","Area x CN"]
{"$rows_left_out":82}
{"sheet":"TofC","index":1,"n_rows":46,"n_cols":23,"rows_kept":46,"cut":false,"hidden":false,"merged":[[41,10,41,11],[42,10,42,11],[43,10,43,11],[44,10,44,11],[45,10,45,11],[36,10,36,11],[18,12,18,13],[27,13,27,15],[39,10,39,11],[40,10,40,11],[38,10,38,11],[37,6,37,11],[36,7,36,8],[35,1,35,2],[34,6,34,11],[35,6,35,11],[0,0,0,10],[27,1,27,5],[2,7,2,10],[5,0,5,10],[5,12,5,22],[27,6,27,9],[21,22,21,24],[10,12,10,13],[11,12,11,13],[12,12,12,13],[13,12,13,13],[8,12,8,13],[15,12,15,13],[16,12,16,13],[17,12,17,13],[45,7,45,8],[38,7,38,8],[39,7,39,8],[40,7,40,8],[41,7,41,8],[42,7,42,8],[43,7,43,8],[44,7,44,8]]}
["TIME OF CONCENTRATION AND TRAVEL TIME"]
["Project:"]
["Designer:",null,null,null,null,null,"Checked:"]
["Date:",null,null,null,null,null,"Date:"]
[]
["PRE DEVELOPMENT",null,null,null,null,null,null,null,null,null,null,null,"POST DEVELOPMENT"]
["FLOW TYPE",null,"LENGTH","SLOPE","SURFACE","MANNINGS","AREA","WP","VELOCITY","TRAVEL",null,null,"FLOW TYPE",null,"LENGTH","SLOPE","SURFACE","MANNINGS","AREA","WP","VELOCITY","TRAVEL"]
[null,null,"(feet)","(ft./ft.)","a","\"N\"","(sq.ft.)","(feet)","(ft./sec.)","TIME",null,null,null,null,"(feet)","(ft./ft.)","a","\"N\"","(sq.ft.)","(feet)","(ft./sec.)","TIME"]
["SHEET FLOW",null,null,null,null,{"$f":"IF(E9>0,(VLOOKUP(E9,N31:P41,3,FALSE)),\"-----------\")","v":"-----------"},"n/a","n/a","n/a",{"$f":"IF(C9>0,(0.007*(F9*C9)^0.8)/((D36)^0.5*(D9)^0.4),0)","v":0},"hours",null,"Dense Grass",null,null,null,null,{"$f":"IF(Q9>0,(VLOOKUP(Q9,N31:P41,3,FALSE)),\"-----------\")","v":"-----------"},"n/a","n/a","n/a",{"$f":"IF(O9>0,(0.007*(R9*O9)^0.8)/((D36)^0.5*(P9)^0.4),0)","v":0},"hours"]
[null,null,{"$f":"IF(C9>300,\"SHEET FLOW SHOULD NOT BE LONGER THAN 300 FEET\",\" \")","v":" "},null,null,null,null,null,null,null,null,null,null,null,{"$f":"IF(O9>300,\"SHEET FLOW SHOULD NOT BE LONGER THAN 300 FEET\",\" \")","v":" "}]
{"$rows_left_out":37}
{"sheet":"TR55","index":2,"n_rows":136,"n_cols":59,"rows_kept":136,"cut":false,"hidden":false,"merged":[[39,7,39,9],[32,4,32,8],[32,9,32,13],[2,1,2,5],[3,1,3,5],[3,9,3,12],[14,4,14,8],[14,9,14,13],[9,0,9,1],[44,53,44,54],[49,53,49,54],[54,53,54,54],[59,53,59,54],[19,53,19,54],[24,53,24,54],[29,53,29,54],[34,53,34,54],[39,53,39,54]]}
["TR 55 PEAK RUNOFF CALCULATION (GRAPHICAL METHOD)",null,null,null,null,null,null,null,null,null,null,null,null,null,null,null,null,null,"Peak Discharge Equation Coefficients for Rainfall Distribution",null,null,null,null,null,null,null,1,null,null,null,"Peak Discharge Equation Coefficients for Rainfall Distribution",null,null,null,null,null,null,null,null,null,"Peak Discharge Equation Coefficients for Rainfall Distribution",null,null,null,null,null,null,null,"Peak Discharge Equation Coefficients for Rainfall Distribution",null,null,null,null,null,null,null,"Curve","Ia","Ia CALCULATED"]
[null,null,null,null,null,null,null,null,null,null,null,null,null,null,null,null,null,null,"TYPE I Rainfall",null,null,null,null,null,null,null,2,null,null,null,"TYPE II Rainfall",null,null,null,null,null,null,null,{"$f":"IF(AND(RCN!$N9>0,RCN!$N9<2000),RCN!$N9*RCN!$O9,0)","v":0},null,"TYPE I Rainfall",null,null,null,null,null,null,null,"TYPE II Rainfall",null,null,null,null,null,null,null,"Number","(in)","(in)"]
["Project:",null,null,null,null,null,null,null,null,null,null,null,null,null,null,null,null,null,null,null,"Ia/P","C0","C1","C2",null,null,3,null,null,null,null,null,"Ia/P","C0","C1","C2",null,null,{"$f":"IF(AND(RCN!$N11>0,RCN!$N11<2000),RCN!$N11*RCN!$O11,0)","v":0},null,null,null,"Ia/P","C0","C1","C2",null,null,null,null,"Ia/P","C0","C1","C2",null,null,30,4.666666666666667,{"$f":"0.2*((1000/BE3)-10)","v":4.666666666666667}]
["Designer:",null,null,null,null,null,null,null,"Checked:",null,null,null,null,null,null,null,null,null,null,1,0.1,2.3054999999999999,-0.51429000000000002,-0.11749999999999999,null,null,4,null,null,null,null,1,0.1,2.5532300000000001,-0.61512,-0.16403000000000001,null,null,{"$f":"IF(AND(RCN!$N12>0,RCN!$N12<2000),RCN!$N12*RCN!$O12,0)","v":0},null,null,1,0.1,2.3054999999999999,-0.51429000000000002,-0.11749999999999999,null,null,null,1,0.1,2.5532300000000001,-0.61512,-0.16403000000000001,null,null,31,4.4516129032258069,{"$f":"0.2*((1000/BE4)-10)","v":4.4516129032258069}]
["Date:",null,null,null,null,null,null,null,null,null,null,null,null,null,null,null,null,null,null,2,0.25,2.1821899999999999,-0.48487999999999998,-6.5890000000000004E-2,null,null,5,null,null,null,null,2,0.3,2.4653200000000002,-0.62256999999999996,-0.11656999999999999,null,null,{"$f":"IF(AND(RCN!$N13>0,RCN!$N13<2000),RCN!$N13*RCN!$O13,0)","v":0},null,null,2,0.25,2.1821899999999999,-0.48487999999999998,-6.5890000000000004E-2,null,null,null,2,0.3,2.4653200000000002,-0.62256999999999996,-0.11656999999999999,null,null,32,4.25,4.25]
[null,null,null,null,null,null,null,null,null,null,null,null,null,null,null,null,null,null,null,3,0.3,2.1062400000000001,-0.45695000000000002,-2.835E-2,null,null,6,null,null,null,null,3,0.35,2.4189600000000002,-0.61594000000000004,-8.8200000000000001E-2,null,null,{"$f":"IF(AND(RCN!$N14>0,RCN!$N14<2000),RCN!$N14*RCN!$O14,0)","v":0},null,null,3,0.3,2.1062400000000001,-0.45695000000000002,-2.835E-2,null,null,null,3,0.35,2.4189600000000002,-0.61594000000000004,-8.8200000000000001E-2,null,null,33,4.0606060606060614,4.0606060606060614]
[null,null,"PRE",null,"POST",null,null,null,null,null,null,null,null,null,null,null,null,null,null,4,0.4,1.1877329999999999,-0.32274000000000003,5.7540000000000001E-2,null,null,7,null,null,null,null,4,0.4,2.36409,-0.59857000000000005,-5.6210000000000003E-2,null,null,{"$f":"IF(AND(RCN!$N15>0,RCN!$N15<2000),RCN!$N15*RCN!$O15,0)","v":0},null,null,4,0.4,1.1877329999999999,-0.32274000000000003,5.7540000000000001E-2,null,null,null,4,0.4,2.36409,-0.59857000000000005,-5.6210000000000003E-2,null,null,34,3.8823529411764706,3.8823529411764706]
["Drainage Area, A, Acres",null,{"$f":"RCN!$K$89","v":0},null,{"$f":"RCN!$Y$89","v":0},null,null,null,null,null,null,null,null,null,null,null,null,null,null,5,0.5,1.67889,-6.93E-2,0,null,null,8,null,null,null,null,5,0.5,2.20282,-0.51598999999999995,-1.259E-2,null,null,{"$f":"IF(AND(RCN!$N16>0,RCN!$N16<2000),RCN!$N16*RCN!$O16,0)","v":0},null,null,5,0.5,1.67889,-6.93E-2,0,null,null,null,5,0.5,2.20282,-0.51598999999999995,-1.259E-2,null,null,35,3.7142857142857149,3.7142857142857149]
["Runoff Curve Number, CN",null,{"$f":"RCN!$K$91","v":0},null,{"$f":"RCN!$Y$91","v":0},null,null,null,null,null,null,null,null,null,null,null,null,null,null,null,null,null,null,null,null,null,9,null,null,null,null,null,null,null,null,null,null,null,{"$f":"IF(AND(RCN!$N17>0,RCN!$N17<2000),RCN!$N17*RCN!$O17,0)","v":0},null,null,null,null,null,null,null,null,null,null,null,null,null,null,null,null,null,36,3.5555555555555558,3.5555555555555558]
["Location Adjustment Factor:",null,null,null,null,null,null,null,null,null,null,null,null,null,null,null,null,null,null,null,null,null,null,null,null,null,10,null,null,null,null,null,null,null,null,null,null,null,{"$f":"IF(AND(RCN!$N18>0,RCN!$N18<2000),RCN!$N18*RCN!$O18,0)","v":0},null,null,null,null,null,null,null,null,null,null,null,null,null,null,null,null,null,37,3.4054054054054057,3.4054054054054057]
{"$rows_left_out":127}
{"sheet":"Runoff Volumes","index":3,"n_rows":96,"n_cols":29,"rows_kept":96,"cut":false,"hidden":false,"merged":[[92,2,92,5],[94,2,94,5],[95,2,95,5],[86,7,86,9],[91,2,91,5],[90,2,90,5],[80,2,80,5],[76,2,76,5],[76,7,76,10],[89,2,89,3],[78,2,78,5],[79,2,79,5],[81,2,81,5],[82,2,82,5],[83,2,83,5],[84,2,84,5],[31,1,31,3],[32,5,32,9],[32,10,32,14],[20,1,20,4],[21,1,21,4],[22,1,22,4],[23,1,23,4],[19,11,19,15],[19,6,19,10],[24,1,24,4],[25,1,25,4],[28,1,28,4],[9,21,9,23],[9,28,9,30],[14,1,14,2],[14,5,14,7],[15,5,15,7],[61,7,61,8],[46,7,46,8],[52,3,52,4],[53,3,53,4],[34,1,34,4],[35,1,35,4],[36,1,36,4],[37,1,37,4],[38,1,38,4],[39,1,39,4],[54,3,54,4],[55,3,55,4],[56,3,56,4]]}
[null,"RUNOFF VOLUMES USING MANUAL RAINFALL"]
[]
[null,"Project:"]
[null,"Designer:",null,null,null,null,null,null,null,"Checked:"]
[null,"Date:",null,null,null,null,null,null,null,"Date:"]
[null,null,null,null,null,null,null,null,null,null,null,null,null,null,null,null,null,null,null,null,"General:"]
["I.","Rainfall Data:"]
[null,"(adapted from Lander, 2004)",null,null,null,null,null,null,null,null,null,null,null,null,null,null,null,null,null,null,null,null,null,null,null,null,null,null,"Channel Protection, Cpv"]
[]
[null,"Recurrence Int (yrs)",null,1,2,10,25,50,null,null,null,null,null,null,null,null,null,null,null,null,null,"Water Quality Volume, WQv",null,null,"[(P)*(I)*(A)]/12",null,null,null,"Overbank Flood Control, Qp-25"]
{"$rows_left_out":87}
{"sheet":" Infiltration Basin","index":4,"n_rows":134,"n_cols":15,"rows_kept":134,"cut":false,"hidden":false,"merged":[[48,2,48,4],[101,7,101,11],[50,1,50,3],[37,1,37,4],[38,1,38,4],[78,1,78,3],[68,1,68,3],[76,3,76,4],[84,1,84,3],[75,3,75,4],[7,21,7,23],[9,21,9,23],[21,1,21,4],[9,28,9,30],[14,1,14,2],[14,5,14,7],[15,5,15,7],[20,1,20,4],[19,5,19,9],[19,10,19,14],[31,1,31,3],[59,1,59,6],[22,1,22,4],[23,1,23,4],[24,1,24,4],[25,1,25,4],[28,1,28,4],[32,5,32,9],[50,4,50,13],[43,7,43,9],[43,1,43,3],[45,2,45,4],[46,2,46,4],[47,2,47,4],[29,6,29,8],[29,11,29,13],[32,10,32,14],[39,1,39,4],[34,1,34,4],[35,1,35,4],[36,1,36,4],[133,2,133,3],[150,7,150,11],[108,1,108,6],[112,2,112,3],[116,1,116,3],[117,1,117,3],[127,1,127,3],[124,3,124,4]]}
[null," INFILTRATION BASIN DESIGN FROM CNMI MANUAL"]
[]
[null,"Project:"]
[null,"Designer:",null,null,null,null,null,null,null,"Checked:"]
[null,"Date:",null,null,null,null,null,null,null,"Date:"]
[]
[null,"Rainfall Data:"]
[null,"(adapted from Lander, 2004)"]
[]
[null,"Recurrence Int (yrs)",null,1,2,10,25,50]
{"$rows_left_out":125}
{"sheet":" Simplified Infil Basin ","index":5,"n_rows":151,"n_cols":15,"rows_kept":151,"cut":false,"hidden":false,"merged":[[150,7,150,11],[76,3,76,4],[78,1,78,3],[84,1,84,3],[101,7,101,11],[108,1,108,6],[112,2,112,3],[116,1,116,3],[118,1,118,3],[127,1,127,3],[133,2,133,3],[135,1,135,4],[32,10,32,14],[34,1,34,4],[35,1,35,4],[36,1,36,4],[69,1,69,3],[38,1,38,4],[39,1,39,4],[43,1,43,3],[43,7,43,9],[45,2,45,4],[46,2,46,4],[47,2,47,4],[48,2,48,4],[50,1,50,3],[50,4,50,13],[59,1,59,6],[37,1,37,4],[24,1,24,4],[25,1,25,4],[28,1,28,4],[29,6,29,8],[32,5,32,9],[29,11,29,13],[31,1,31,3],[19,5,19,9],[19,10,19,14],[20,1,20,4],[21,1,21,4],[22,1,22,4],[23,1,23,4],[15,5,15,7],[7,21,7,23],[9,21,9,23],[9,28,9,30],[14,1,14,2],[14,5,14,7]]}
[null,"SIMPLIFIED INFILTRATION BASIN DESIGN FROM GEPA"]
[]
[null,"Project:"]
[null,"Designer:",null,null,null,null,null,null,null,"Checked:"]
[null,"Date:",null,null,null,null,null,null,null,"Date:"]
[]
[null,"Rainfall Data:"]
[null,"(adapted from Lander, 2004)"]
[]
[null,"Recurrence Int (yrs)",null,1,2,10,25,50]
{"$rows_left_out":142}
{"sheet":"Detention Basins","index":6,"n_rows":174,"n_cols":20,"rows_kept":174,"cut":false,"hidden":false,"merged":[[173,1,173,3],[165,1,165,3],[146,1,146,4],[168,1,168,3],[170,1,170,3],[171,1,171,3],[172,1,172,3],[154,1,154,4],[156,1,156,4],[157,1,157,4],[169,1,169,3],[130,12,132,12],[130,1,132,1],[130,2,132,2],[131,3,131,4],[132,5,132,6],[132,7,132,8],[132,3,132,4],[131,5,131,9],[130,10,130,11],[131,10,131,11],[97,1,97,3],[167,1,167,3],[99,6,99,8],[92,6,92,8],[94,1,94,3],[166,1,166,3],[144,1,144,4],[161,1,161,3],[162,1,162,3],[163,1,163,3],[164,1,164,3],[100,6,100,8],[130,3,130,9],[103,1,103,3],[105,1,105,3],[103,6,103,8],[104,1,104,3],[97,6,97,8],[108,1,108,4],[111,1,111,3],[112,1,112,3],[113,1,113,3],[114,1,114,3],[111,6,111,8],[113,6,113,8],[114,6,114,8],[121,6,121,8],[117,1,117,3],[115,1,115,3],[116,1,116,3],[121,2,121,4],[122,2,122,3],[116,6,116,8],[146,6,146,8],[2,2,2,5],[3,2,3,5],[11,1,11,3],[12,1,12,3],[13,1,13,3],[6,2,6,3],[85,1,85,2],[93,6,93,8],[94,6,94,8],[88,0,88,2],[90,1,90,4],[91,1,91,3],[92,1,92,3],[93,1,93,3],[90,6,90,9],[91,6,91,8],[117,6,117,8],[122,6,122,8],[124,3,124,4],[110,1,110,4],[112,6,112,8],[110,6,110,9],[115,6,115,8],[148,6,148,8],[160,1,160,4],[99,1,99,3],[151,1,151,2],[151,3,151,4],[152,1,152,4],[153,1,153,4],[98,1,98,3],[3,9,3,12],[4,2,4,3],[4,9,4,10],[8,0,8,3],[10,1,10,3],[80,0,80,2],[36,0,36,2],[17,1,17,3],[26,1,26,4],[27,1,27,4],[28,1,28,4],[98,6,98,8],[95,6,95,8],[96,6,96,8],[95,1,95,3],[96,1,96,3]]}
["This tab sizes Detention Ponds according to the 2006 CNMI Manual"]
[]
["Project:"]
["Designer:"]
["Date:"]
[]
[null,"Units:","English"]
[]
["1.  General Storage Volume Requirements",null,null,null,null,"(from \"Runoff Volumes\" worksheet)"]
[]
{"$rows_left_out":165}
{"sheet":"Swales","index":7,"n_rows":70,"n_cols":12,"rows_kept":70,"cut":false,"hidden":false,"merged":[[17,11,17,13],[62,1,62,2],[64,2,64,3],[65,2,65,3],[66,2,66,3],[48,1,48,3],[49,1,49,3],[50,1,50,3],[52,1,52,2],[53,1,53,3],[17,7,17,8],[18,7,18,8],[19,7,19,8],[17,1,17,3],[39,6,39,8],[54,7,54,8],[67,2,67,3],[54,1,54,3],[57,1,57,3],[58,1,58,3],[59,1,59,3],[60,1,60,3],[3,9,3,12],[4,2,4,3],[4,9,4,10],[8,0,8,3],[10,1,10,3],[11,1,11,3],[12,1,12,3],[13,1,13,3],[2,2,2,5],[3,2,3,5],[15,0,15,2],[41,1,41,3],[21,1,21,3],[19,1,19,3],[24,0,24,1],[26,1,26,3],[27,1,27,3],[20,1,20,3],[29,1,29,3],[30,1,30,3],[31,1,31,3],[34,1,34,3],[33,6,33,7],[32,1,32,3],[47,1,47,3],[43,1,43,3],[44,1,44,3],[45,1,45,3],[36,1,36,3],[37,1,37,3],[39,1,39,3],[40,1,40,3]]}
["Swale Design"]
[]
["Project:"]
["Designer:",null,null,null,null,null,null,"Checked:"]
["Date:",null,null,null,null,null,null,"Date:"]
[]
[]
[]
["1.  General Storage Volume Requirements",null,null,null,null,"(from \"Runoff Volumes\" worksheet)"]
[]
{"$rows_left_out":61}
{"sheet":"Bioretention","index":8,"n_rows":50,"n_cols":10,"rows_kept":50,"cut":false,"hidden":false,"merged":[[44,1,44,3],[49,1,49,3],[3,9,3,12],[4,2,4,3],[4,9,4,10],[8,0,8,3],[48,1,48,3],[31,0,31,3],[37,1,37,3],[38,1,38,3],[33,1,33,3],[34,1,34,3],[35,1,35,3],[40,1,40,3],[42,1,42,3],[46,1,46,3],[10,1,10,3],[11,1,11,3],[12,1,12,3],[13,1,13,3],[2,2,2,5],[3,2,3,5],[15,0,15,2],[17,1,17,3],[17,7,17,8],[18,7,18,8],[19,1,19,3],[19,7,19,8],[20,1,20,3],[21,1,21,3],[24,0,24,3],[28,1,28,3],[29,1,29,3],[26,1,26,3]]}
["Bio-Remediation Measures"]
[]
["Project:"]
["Designer:",null,null,null,null,null,null,"Checked:"]
["Date:",null,null,null,null,null,null,"Date:"]
[]
[]
[]
["1.  General Storage Volume Requirements",null,null,null,null,"(from \"Runoff Volumes\" worksheet)"]
[]
{"$rows_left_out":41}
{"sheet":"Sand Filter","index":9,"n_rows":79,"n_cols":11,"rows_kept":79,"cut":false,"hidden":false,"merged":[[77,7,77,10],[75,1,75,3],[77,1,77,3],[78,1,78,3],[54,1,54,3],[64,1,64,3],[69,1,69,3],[22,0,22,3],[52,7,52,8],[71,1,71,3],[72,1,72,3],[74,1,74,3],[54,7,54,10],[64,7,64,10],[59,1,59,3],[61,1,61,3],[62,1,62,3],[58,1,58,3],[53,1,53,3],[63,1,63,3],[66,0,66,3],[68,1,68,3],[25,1,25,3],[32,1,32,3],[2,2,2,5],[3,2,3,5],[3,9,3,12],[4,2,4,3],[4,9,4,10],[7,0,7,2],[9,1,9,3],[11,1,11,3],[12,1,12,3],[13,1,13,3],[15,0,15,3],[17,1,17,3],[18,1,18,3],[19,1,19,3],[20,1,20,3],[26,1,26,3],[27,1,27,3],[28,1,28,3],[29,1,29,3],[31,1,31,3],[0,0,0,1],[20,7,20,8],[51,1,51,3],[52,1,52,3],[48,1,48,3],[49,1,49,3],[48,7,48,8],[49,7,49,8],[50,7,50,8],[34,1,34,3],[36,0,36,3],[39,1,39,3],[42,1,42,3],[24,1,24,3],[43,1,43,3],[46,0,46,3]]}
["Sand Filter"]
[]
["Project:"]
["Designer:",null,null,null,null,null,null,"Checked:"]
["Date:",null,null,null,null,null,null,"Date:"]
[]
[]
["1. Project Area Details"]
[]
[null,"Drainage Area (Acres)",null,null,"A =>",0.19,null,null,"Q1-year (cfs)","=>"]
{"$rows_left_out":70}
{"sheet":"SBUH","index":10,"n_rows":162,"n_cols":19,"rows_kept":162,"cut":false,"hidden":false,"merged":[[2,1,2,13],[11,7,11,8],[11,9,11,10],[4,1,4,5],[5,1,5,5],[5,9,5,12]]}
[]
[]
[null,"Santa Barbara Urban Hydrograph"]
[]
["Project:"]
["Designer:",null,null,null,null,null,null,null,"Checked:"]
["Date:",null,null,null,null,null,null,null,"Date:"]
[]
[]
[null,null,null,null,null,null,null,null,null,null,null,null,null,null,null,"Units of Choice:","English"]
{"$rows_left_out":153}
{"sheet":"Lookup","index":11,"n_rows":81,"n_cols":63,"rows_kept":81,"cut":false,"hidden":false,"merged":[[27,19,27,23],[76,2,76,3],[77,2,77,3],[78,2,78,3],[79,2,79,3],[75,2,75,3],[74,4,74,5],[75,4,75,5],[58,12,58,13],[59,12,59,13],[60,12,60,13],[60,14,60,15],[61,14,61,15],[27,11,27,12],[28,11,28,12],[29,11,29,12],[80,2,80,3],[76,4,76,5],[77,4,77,5],[78,4,78,5],[79,4,79,5],[80,4,80,5],[1,2,1,4],[1,10,1,13],[74,2,74,3],[27,13,27,16],[26,11,26,16],[43,12,43,13],[44,12,44,13],[45,12,45,13],[46,12,46,13],[47,12,47,13],[36,12,37,13],[39,12,39,13],[40,12,40,13],[41,12,41,13],[58,14,58,15],[59,14,59,15],[56,14,56,15],[55,12,55,15],[42,12,42,13],[56,12,56,13],[30,11,30,12],[33,11,33,16],[34,11,34,16],[48,12,48,13],[49,12,49,13]]}
[null,null,null,null,null,null,null,null,null,null,null,null,null,null,null,null,null,null,null,null,null,null,null,null,null,null,null,null,null,null,"EM 1110-2-1417",null,null,null,null,null,null,null,null,null,"LTAP manual",null,null,null,null,null,null,null,null,null,null,"LTAP MANUAL",null,null,null,null,null,null,null,null,null,null,"LTAP"]
[null,null,"Manning's Values",null,null,null,null,null,null,null,"Runoff Coefficients",null,null,null,null,null,null,null,"new runoff coefficients, from Mays 2010 Water Resources Engineering.",null,null,null,null,null,null,null,null,null,null,null,"Flood-Runoff Analysis",null,null,null,null,null,null,null,null,null,"rural ",null,null,null,null,null,null,null,null,null,null,"URBAN",null,null,null,null,null,null,null,null,null,null,"composite runoff"]
[]
[null,null,null,null,null,null,null,null,null,null,null,null,null,null,null,null,null,null,"surface","25 year"]
[null,null,null,null,null,null,null,null,null,null,null,null,null,null,null,null,null,null,"Asphaltic",0.86,"Asphaltic C=0.86"]
[null,null,null,null,null,null,null,null,null,null,null,null,null,null,null,null,null,null,"Concrete/roof",0.88,"Concrete/roof C=0.88"]
[null,null,null,null,null,null,null,null,null,null,null,null,null,null,null,null,null,null,"Grass, <50% grass area, 0-2% slope",0.4,"Grass, <50% grass area, 0-2% slope C=0.4"]
[null,null,null,null,null,null,null,null,null,null,null,null,null,null,null,null,null,null,"Grass, <50% grass area, 2-7% slope",0.46,"Grass, <50% grass area, 2-7% slope C=0.46"]
[null,null,null,null,null,null,null,null,null,null,null,null,null,null,null,null,null,null,"Grass, <50% grass area, over 7% slope",0.49,"Grass, <50% grass area, over 7% slope C=0.49"]
[null,null,null,null,null,null,null,null,null,null,null,null,null,null,null,null,null,null,"Grass, 50-75% grass area, 0-2% slope",0.34,"Grass, 50-75% grass area, 0-2% slope C=0.34"]
{"$rows_left_out":72}
{"sheet":"Soils","index":12,"n_rows":77,"n_cols":17,"rows_kept":77,"cut":false,"hidden":false,"merged":[[1,3,1,4],[2,7,3,9],[2,12,3,13],[2,14,3,15],[4,7,4,9],[4,12,4,13],[4,14,4,15],[2,10,3,11],[1,7,1,17],[5,7,5,9],[6,7,6,9],[7,7,7,9],[8,7,8,9],[9,7,9,9],[10,7,10,9],[11,7,11,9],[12,7,12,9],[13,7,13,9],[14,7,14,9],[13,12,13,13],[14,12,14,13],[5,12,5,13],[6,12,6,13],[7,12,7,13],[8,12,8,13],[9,12,9,13],[13,14,13,15],[14,14,14,15],[5,14,5,15],[6,14,6,15],[7,14,7,15],[8,14,8,15],[9,14,9,15],[11,10,11,11],[12,10,12,11],[2,16,3,17],[4,10,4,11],[5,10,5,11],[6,10,6,11],[7,10,7,11],[10,14,10,15],[11,14,11,15],[12,14,12,15],[10,12,10,13],[11,12,11,13],[12,12,12,13],[13,10,13,11],[14,10,14,11],[4,16,4,17],[5,16,5,17],[6,16,6,17],[7,16,7,17],[8,16,8,17],[9,16,9,17],[10,16,10,17],[11,16,11,17],[12,16,12,17],[13,16,13,17],[14,16,14,17],[8,10,8,11],[9,10,9,11],[10,10,10,11]]}
[]
[null,null,null,"Hydrologic Soil Groups of Guam",null,null,null,"Typical Design Infiltration Rates for Different Soil Textures (Table 3.5, CNMI Manual, Vol. 1, Sect. 3.2.4.3d)"]
[null,null,null,null,null,null,null,"USDA Soil Texture",null,null,"Infiltration Rate (fc) (in/min)",null,"Infiltration Rate (fc) (in/hr)",null,"Infiltration Rate (fc) (ft/min)",null,"Infiltration Rate (fc) (ft/hr)"]
[]
[null,null,null,"Soil Name","HSG",null,null,"Sand",null,null,{"$f":"$M5/60","v":0.13783333333333334},null,8.27,null,1.15E-2,null,{"$f":"$M5/12","v":0.68916666666666659}]
[null,null,null,null,null,null,null,"Loamy Sand",null,null,{"$f":"$M6/60","v":4.016666666666667E-2},null,2.41,null,3.3E-3,null,{"$f":"$M6/12","v":0.20083333333333334}]
[null,null,null,"Agfayan clay, 15 to 30 percent slopes","D",null,null,"Sandy Loam",null,null,1.7000000000000001E-2,null,1.02,null,1.4E-3,null,8.5000000000000006E-2]
[null,null,null,"Agfayan clay, 30 to 60 percent slopes","D",null,null,"Loam",null,null,8.6666666666666663E-3,null,0.52,null,6.9999999999999999E-4,null,4.3333333333333335E-2]
[null,null,null,"Agfayan-Rock outcrop complex, 7 to 15 percent slopes","D",null,null,"Silt Loam",null,null,4.5000000000000005E-3,null,0.27,null,4.0000000000000002E-4,null,2.2500000000000003E-2]
[null,null,null,"Agfayan-Rock outcrop complex, 15 to 30 percent slopes","D",null,null,"Sandy Clay Loam",null,null,2.8333333333333335E-3,null,0.17,null,2.0000000000000001E-4,null,1.4166666666666668E-2]
{"$rows_left_out":68}
{"sheet":"Help","index":13,"n_rows":70,"n_cols":1,"rows_kept":70,"cut":false,"hidden":false,"merged":[]}
["TR55 PEAK RUNOFF CALCULATION"]
["GRAPHICAL METHOD"]
[]
["This spreadsheet computes peak flow runoff from a watershed using the graphical method"]
["found in TR55, Urban Hydrology for Small Watersheds.  "]
[]
[]
[]
["You will need to input data regarding the area(s) you are draining to a point,"]
["such as drainage area, channel shapes and slopes, and soil hydrologic group,"]
{"$rows_left_out":60}